Build failed in Jenkins: Stripes 1.5.x #125

classic Classic list List threaded Threaded
1 message Options
Reply | Threaded
Open this post in threaded view
|

Build failed in Jenkins: Stripes 1.5.x #125

Ben Gunter-2
See <http://www.stripesframework.org/hudson/job/Stripes%201.5.x/125/changes>

Changes:

[vankeisb] fix STS-899, STS-894

[vankeisb] use WebtestCaseFixed (build problems in jenkins)

[vankeisb] cargo version in webtests poms

[vankeisb] fix STS-725 & STS-494

[vankeisb] STS-891 : use static final constant to workaround not-null put in concurrent hashmap

[vankeisb] fix STS-822 (deprecate use of 'this' in EL validation expressions)

[vankeisb] fix NPE in cache interceptor (can't put null in concurrent hashmap)

[fdaoud] Fix for STS-891: Cache in HttpCacheInterceptor needs to be concurrent

------------------------------------------
[...truncated 477 lines...]
AU        examples/web/bugzooky/bug.png
A         examples/web/bugzooky/bugzooky.css
A         examples/web/bugzooky/taglibs.jsp
A         examples/web/bugzooky/Register2.jsp
A         examples/web/bugzooky/Login.jsp
A         examples/web/bugzooky/AdministerBugzooky.jsp
A         examples/web/bugzooky/BugList.jsp
A         examples/web/bugzooky/Exit.jsp
A         examples/web/bugzooky/bugzooky.js
AU        examples/web/bugzooky/trash.png
A         examples/web/bugzooky/AddEditBug.jsp
A         examples/web/bugzooky/BulkAddEditBugs.jsp
A         examples/web/bugzooky/layout
A         examples/web/bugzooky/layout/header.jsp
A         examples/web/bugzooky/layout/standard.jsp
A         examples/web/index.html
A         examples/web/quickstart
A         examples/web/quickstart/index.jsp
A         examples/Examples.iml
A         examples/build.xml
A         .settings
A         .settings/org.eclipse.jdt.core.prefs
A         .settings/org.eclipse.wst.common.project.facet.core.xml
A         .settings/org.eclipse.wst.common.component
 U        .
At revision 1527
Parsing POMs
Modules changed, recalculating dependency graph
[1.5.x] $ /usr/java/default/bin/java -Dwt.headless -cp /var/lib/jenkins/plugins/maven-plugin/WEB-INF/lib/maven-agent-1.2.jar:/usr/local/maven2/boot/classworlds-1.1.jar hudson.maven.agent.Main /usr/local/maven2 /usr/local/apache-tomcat-6.0.35/webapps/jenkins/WEB-INF/lib/remoting-2.17.jar /var/lib/jenkins/plugins/maven-plugin/WEB-INF/lib/maven-interceptor-1.2.jar 49864 /var/lib/jenkins/plugins/maven-plugin/WEB-INF/lib/maven2.1-interceptor-1.2.jar
<===[JENKINS REMOTING CAPACITY]===>   channel started
log4j:WARN No appenders could be found for logger (org.apache.commons.beanutils.converters.BooleanConverter).
log4j:WARN Please initialize the log4j system properly.
Executing Maven:  -B -f <http://www.stripesframework.org/hudson/job/Stripes%201.5.x/ws/1.5.x/pom.xml> -s /var/lib/jenkins/.m2/settings.xml clean deploy
[INFO] Scanning for projects...
[INFO] Reactor build order:
[INFO]   Stripes Parent
[INFO]   Stripes
[INFO]   Stripes Tests
[INFO]   Stripes Examples Webapp
[INFO] ------------------------------------------------------------------------
[INFO] Building Stripes Parent
[INFO]    task-segment: [clean, deploy]
[INFO] ------------------------------------------------------------------------
[INFO] [clean:clean {execution: default-clean}]
[INFO] [enforcer:enforce {execution: enforce-maven}]
[INFO] [site:attach-descriptor {execution: default-attach-descriptor}]
[INFO] [install:install {execution: default-install}]
[INFO] Installing <http://www.stripesframework.org/hudson/job/Stripes%201.5.x/ws/1.5.x/pom.xml> to /usr/local/tomcat/.m2/repository/net/sourceforge/stripes/stripes-parent/1.5.8-SNAPSHOT/stripes-parent-1.5.8-SNAPSHOT.pom
[INFO] [deploy:deploy {execution: default-deploy}]
[INFO] Retrieving previous build number from sonatype-nexus-snapshots
[WARNING] *** CHECKSUM FAILED - Checksum failed on download: local = 'b8c59301314be74d86b982f481f1291fdd906e4b'; remote = '432a4d6a5d2943c7bef1481e1fb45bc0b3315703' - RETRYING
[WARNING] *** CHECKSUM FAILED - Checksum failed on download: local = 'b8c59301314be74d86b982f481f1291fdd906e4b'; remote = '432a4d6a5d2943c7bef1481e1fb45bc0b3315703' - IGNORING
Uploading: https://oss.sonatype.org/content/repositories/snapshots//net/sourceforge/stripes/stripes-parent/1.5.8-SNAPSHOT/stripes-parent-1.5.8-20130723.201709-3.pom
7K uploaded  (stripes-parent-1.5.8-20130723.201709-3.pom)
[INFO] Retrieving previous metadata from sonatype-nexus-snapshots
[WARNING] *** CHECKSUM FAILED - Checksum failed on download: local = 'b8c59301314be74d86b982f481f1291fdd906e4b'; remote = '432a4d6a5d2943c7bef1481e1fb45bc0b3315703' - RETRYING
[WARNING] *** CHECKSUM FAILED - Checksum failed on download: local = 'b8c59301314be74d86b982f481f1291fdd906e4b'; remote = '432a4d6a5d2943c7bef1481e1fb45bc0b3315703' - IGNORING
[INFO] Uploading repository metadata for: 'snapshot net.sourceforge.stripes:stripes-parent:1.5.8-SNAPSHOT'
[INFO] Retrieving previous metadata from sonatype-nexus-snapshots
[INFO] Uploading repository metadata for: 'artifact net.sourceforge.stripes:stripes-parent'
[JENKINS] Archiving <http://www.stripesframework.org/hudson/job/Stripes%201.5.x/ws/1.5.x/pom.xml> to /var/lib/jenkins/jobs/Stripes 1.5.x/modules/net.sourceforge.stripes$stripes-parent/builds/2013-07-23_15-16-59/archive/net.sourceforge.stripes/stripes-parent/1.5.8-SNAPSHOT/stripes-parent-1.5.8-SNAPSHOT.pom
[JENKINS] Archiving /usr/local/tomcat/.m2/repository/net/sourceforge/stripes/stripes-parent/1.5.8-SNAPSHOT/stripes-parent-1.5.8-SNAPSHOT.pom to /var/lib/jenkins/jobs/Stripes 1.5.x/modules/net.sourceforge.stripes$stripes-parent/builds/2013-07-23_15-16-59/archive/net.sourceforge.stripes/stripes-parent/1.5.8-20130723.201709-3/stripes-parent-1.5.8-20130723.201709-3.pom
[INFO] ------------------------------------------------------------------------
[INFO] Building Stripes
[INFO]    task-segment: [clean, deploy]
[INFO] ------------------------------------------------------------------------
[INFO] [clean:clean {execution: default-clean}]
[INFO] [enforcer:enforce {execution: enforce-maven}]
[INFO] [resources:resources {execution: default-resources}]
[INFO] Using 'UTF-8' encoding to copy filtered resources.
[INFO] skip non existing resourceDirectory <http://www.stripesframework.org/hudson/job/Stripes%201.5.x/ws/1.5.x/stripes/src/main/resources>
[INFO] [antrun:run {execution: generate-tlds}]
[INFO] Executing tasks

main:
     [copy] Copying 1 file to <http://www.stripesframework.org/hudson/job/Stripes%201.5.x/ws/1.5.x/stripes/target/classes/META-INF>
     [copy] Copying 1 file to <http://www.stripesframework.org/hudson/job/Stripes%201.5.x/ws/1.5.x/stripes/target/classes/META-INF>
     [copy] Copying 1 file to <http://www.stripesframework.org/hudson/job/Stripes%201.5.x/ws/1.5.x/stripes/target/classes/META-INF>
[INFO] Executed tasks
[INFO] [compiler:compile {execution: default-compile}]
[INFO] Compiling 242 source files to <http://www.stripesframework.org/hudson/job/Stripes%201.5.x/ws/1.5.x/stripes/target/classes>
[JENKINS] Archiving <http://www.stripesframework.org/hudson/job/Stripes%201.5.x/ws/1.5.x/stripes/pom.xml> to /var/lib/jenkins/jobs/Stripes 1.5.x/modules/net.sourceforge.stripes$stripes/builds/2013-07-23_15-16-59/archive/net.sourceforge.stripes/stripes/1.5.8-SNAPSHOT/stripes-1.5.8-SNAPSHOT.pom
[INFO] ------------------------------------------------------------------------
[ERROR] BUILD FAILURE
[INFO] ------------------------------------------------------------------------
[INFO] Compilation failure

<http://www.stripesframework.org/hudson/job/Stripes%201.5.x/ws/1.5.x/stripes/src/net/sourceforge/stripes/tools/SiteStructureTool.java>:[17,25] error: package com.sun.mirror.apt does not exist

<http://www.stripesframework.org/hudson/job/Stripes%201.5.x/ws/1.5.x/stripes/src/net/sourceforge/stripes/tools/SiteStructureTool.java>:[18,25] error: package com.sun.mirror.apt does not exist

<http://www.stripesframework.org/hudson/job/Stripes%201.5.x/ws/1.5.x/stripes/src/net/sourceforge/stripes/tools/SiteStructureTool.java>:[19,25] error: package com.sun.mirror.apt does not exist

<http://www.stripesframework.org/hudson/job/Stripes%201.5.x/ws/1.5.x/stripes/src/net/sourceforge/stripes/tools/SiteStructureTool.java>:[20,33] error: package com.sun.mirror.declaration does not exist

<http://www.stripesframework.org/hudson/job/Stripes%201.5.x/ws/1.5.x/stripes/src/net/sourceforge/stripes/tools/SiteStructureTool.java>:[21,33] error: package com.sun.mirror.declaration does not exist

<http://www.stripesframework.org/hudson/job/Stripes%201.5.x/ws/1.5.x/stripes/src/net/sourceforge/stripes/tools/SiteStructureTool.java>:[22,33] error: package com.sun.mirror.declaration does not exist

<http://www.stripesframework.org/hudson/job/Stripes%201.5.x/ws/1.5.x/stripes/src/net/sourceforge/stripes/tools/SiteStructureTool.java>:[23,33] error: package com.sun.mirror.declaration does not exist

<http://www.stripesframework.org/hudson/job/Stripes%201.5.x/ws/1.5.x/stripes/src/net/sourceforge/stripes/tools/SiteStructureTool.java>:[98,42] error: cannot find symbol

could not parse error message:   symbol: class AnnotationProcessor
<http://www.stripesframework.org/hudson/job/Stripes%201.5.x/ws/1.5.x/stripes/src/net/sourceforge/stripes/tools/SiteStructureTool.java>:98: error: cannot find symbol
public class SiteStructureTool implements AnnotationProcessor, AnnotationProcessorFactory {
                                                               ^

could not parse error message:   symbol: class AnnotationProcessorFactory
<http://www.stripesframework.org/hudson/job/Stripes%201.5.x/ws/1.5.x/stripes/src/net/sourceforge/stripes/tools/SiteStructureTool.java>:108: error: cannot find symbol
    private Set<AnnotationTypeDeclaration> typeDeclarations;
                ^

could not parse error message:   symbol:   class AnnotationTypeDeclaration
  location: class SiteStructureTool
<http://www.stripesframework.org/hudson/job/Stripes%201.5.x/ws/1.5.x/stripes/src/net/sourceforge/stripes/tools/SiteStructureTool.java>:109: error: cannot find symbol
    private AnnotationProcessorEnvironment environment;
            ^

could not parse error message:   symbol:   class AnnotationProcessorEnvironment
  location: class SiteStructureTool
<http://www.stripesframework.org/hudson/job/Stripes%201.5.x/ws/1.5.x/stripes/src/net/sourceforge/stripes/tools/SiteStructureTool.java>:136: error: cannot find symbol
    public AnnotationProcessor getProcessorFor(Set<AnnotationTypeDeclaration> set,
                                                   ^

could not parse error message:   symbol:   class AnnotationTypeDeclaration
  location: class SiteStructureTool
<http://www.stripesframework.org/hudson/job/Stripes%201.5.x/ws/1.5.x/stripes/src/net/sourceforge/stripes/tools/SiteStructureTool.java>:137: error: cannot find symbol
                                               AnnotationProcessorEnvironment env) {
                                               ^

could not parse error message:   symbol:   class AnnotationProcessorEnvironment
  location: class SiteStructureTool
<http://www.stripesframework.org/hudson/job/Stripes%201.5.x/ws/1.5.x/stripes/src/net/sourceforge/stripes/tools/SiteStructureTool.java>:136: error: cannot find symbol
    public AnnotationProcessor getProcessorFor(Set<AnnotationTypeDeclaration> set,
           ^

could not parse error message:   symbol:   class AnnotationProcessor
  location: class SiteStructureTool
<http://www.stripesframework.org/hudson/job/Stripes%201.5.x/ws/1.5.x/stripes/src/net/sourceforge/stripes/tools/SiteStructureTool.java>:224: error: cannot find symbol
    protected void processUrlBindings(Collection<Declaration> declarations) {
                                                 ^

could not parse error message:   symbol:   class Declaration
  location: class SiteStructureTool
<http://www.stripesframework.org/hudson/job/Stripes%201.5.x/ws/1.5.x/stripes/src/net/sourceforge/stripes/tools/SiteStructureTool.java>:242: error: cannot find symbol
    protected void processHandlerAnnotations(Collection<Declaration> declarations) {
                                                        ^

could not parse error message:   symbol:   class Declaration
  location: class SiteStructureTool
<http://www.stripesframework.org/hudson/job/Stripes%201.5.x/ws/1.5.x/stripes/src/net/sourceforge/stripes/tools/SiteStructureTool.java>:349: error: cannot find symbol
    AnnotationTypeDeclaration getTypeDeclaration(Class<? extends Annotation> type) {
    ^

could not parse error message:   symbol:   class AnnotationTypeDeclaration
  location: class SiteStructureTool
<http://www.stripesframework.org/hudson/job/Stripes%201.5.x/ws/1.5.x/stripes/src/net/sourceforge/stripes/tools/SiteStructureTool.java>:367: error: cannot find symbol
    private String getCodeFragment(Declaration declaration) {
                                   ^

could not parse error message:   symbol:   class Declaration
  location: class SiteStructureTool
<http://www.stripesframework.org/hudson/job/Stripes%201.5.x/ws/1.5.x/stripes/src/net/sourceforge/stripes/tools/SiteStructureTool.java>:409: error: cannot find symbol
    SortedSet<String> getResolutions(Declaration declaration) {
                                     ^

could not parse error message:   symbol:   class Declaration
  location: class SiteStructureTool
<http://www.stripesframework.org/hudson/job/Stripes%201.5.x/ws/1.5.x/stripes/src/net/sourceforge/stripes/tools/SiteStructureTool.java>:150: error: cannot find symbol
        AnnotationTypeDeclaration typeDec = getTypeDeclaration(UrlBinding.class);
        ^

could not parse error message:   symbol:   class AnnotationTypeDeclaration
  location: class SiteStructureTool
<http://www.stripesframework.org/hudson/job/Stripes%201.5.x/ws/1.5.x/stripes/src/net/sourceforge/stripes/tools/SiteStructureTool.java>:151: error: cannot find symbol
        Collection<Declaration> declarations = this.environment.getDeclarationsAnnotatedWith(typeDec);
                   ^

could not parse error message:   symbol:   class Declaration
  location: class SiteStructureTool
<http://www.stripesframework.org/hudson/job/Stripes%201.5.x/ws/1.5.x/stripes/src/net/sourceforge/stripes/tools/SiteStructureTool.java>:156: error: cannot find symbol
        declarations = new HashSet<Declaration>();
                                   ^

could not parse error message:   symbol:   class Declaration
  location: class SiteStructureTool
<http://www.stripesframework.org/hudson/job/Stripes%201.5.x/ws/1.5.x/stripes/src/net/sourceforge/stripes/tools/SiteStructureTool.java>:225: error: cannot find symbol
        for (Declaration declaration : declarations) {
             ^

could not parse error message:   symbol:   class Declaration
  location: class SiteStructureTool
<http://www.stripesframework.org/hudson/job/Stripes%201.5.x/ws/1.5.x/stripes/src/net/sourceforge/stripes/tools/SiteStructureTool.java>:226: error: cannot find symbol
            ClassDeclaration classDec = (ClassDeclaration) declaration;
            ^

could not parse error message:   symbol:   class ClassDeclaration
  location: class SiteStructureTool
<http://www.stripesframework.org/hudson/job/Stripes%201.5.x/ws/1.5.x/stripes/src/net/sourceforge/stripes/tools/SiteStructureTool.java>:226: error: cannot find symbol
            ClassDeclaration classDec = (ClassDeclaration) declaration;
                                         ^

could not parse error message:   symbol:   class ClassDeclaration
  location: class SiteStructureTool
<http://www.stripesframework.org/hudson/job/Stripes%201.5.x/ws/1.5.x/stripes/src/net/sourceforge/stripes/tools/SiteStructureTool.java>:243: error: cannot find symbol
        for (Declaration declaration : declarations) {
             ^

could not parse error message:   symbol:   class Declaration
  location: class SiteStructureTool
<http://www.stripesframework.org/hudson/job/Stripes%201.5.x/ws/1.5.x/stripes/src/net/sourceforge/stripes/tools/SiteStructureTool.java>:244: error: cannot find symbol
            MethodDeclaration methodDec = (MethodDeclaration) declaration;
            ^

could not parse error message:   symbol:   class MethodDeclaration
  location: class SiteStructureTool
<http://www.stripesframework.org/hudson/job/Stripes%201.5.x/ws/1.5.x/stripes/src/net/sourceforge/stripes/tools/SiteStructureTool.java>:244: error: cannot find symbol
            MethodDeclaration methodDec = (MethodDeclaration) declaration;
                                           ^

could not parse error message:   symbol:   class MethodDeclaration
  location: class SiteStructureTool
<http://www.stripesframework.org/hudson/job/Stripes%201.5.x/ws/1.5.x/stripes/src/net/sourceforge/stripes/tools/SiteStructureTool.java>:245: error: cannot find symbol
            ClassDeclaration classDec = (ClassDeclaration) methodDec.getDeclaringType();
            ^

could not parse error message:   symbol:   class ClassDeclaration
  location: class SiteStructureTool
<http://www.stripesframework.org/hudson/job/Stripes%201.5.x/ws/1.5.x/stripes/src/net/sourceforge/stripes/tools/SiteStructureTool.java>:245: error: cannot find symbol
            ClassDeclaration classDec = (ClassDeclaration) methodDec.getDeclaringType();
                                         ^

could not parse error message:   symbol:   class ClassDeclaration
  location: class SiteStructureTool
<http://www.stripesframework.org/hudson/job/Stripes%201.5.x/ws/1.5.x/stripes/src/net/sourceforge/stripes/tools/SiteStructureTool.java>:350: error: cannot find symbol
        for (AnnotationTypeDeclaration declaration : this.typeDeclarations) {
             ^


[INFO] ------------------------------------------------------------------------
[INFO] For more information, run Maven with the -e switch
[INFO] ------------------------------------------------------------------------
[INFO] Total time: 14 seconds
[INFO] Finished at: Tue Jul 23 15:17:19 CDT 2013
[INFO] Final Memory: 37M/301M
[INFO] ------------------------------------------------------------------------
channel stopped
IRC notifier plugin: Sending notification to: #stripes

------------------------------------------------------------------------------
See everything from the browser to the database with AppDynamics
Get end-to-end visibility with application monitoring from AppDynamics
Isolate bottlenecks and diagnose root cause in seconds.
Start your free trial of AppDynamics Pro today!
http://pubads.g.doubleclick.net/gampad/clk?id=48808831&iu=/4140/ostg.clktrk
_______________________________________________
Stripes-development mailing list
[hidden email]
https://lists.sourceforge.net/lists/listinfo/stripes-development